{"text_format":"1","workbook":"xlsx","n_sheets":7,"sheets":["quasi-static Net ZEB evaluation","quasi-static weighting factors","Building Data","static weighting factors","Operating costs","Net ZEB evaluation","Calculation"],"not_rendered":{"charts":18,"images":16,"macros":1,"external_links":2,"defined_names":32,"comments":0,"pivot_tables":0},"unopened":[],"bounds":{"document_bytes":16777216,"sheet_cells":100000,"rows_first":2000,"rows_last":500,"rows_between":2000,"halvings":0,"cell_chars":16384,"cell_head_chars":4096},"cells_cut":0,"cells_raw":0,"read":"whole","date_system":"1900"}

{"sheet":"quasi-static Net ZEB evaluation","index":0,"n_rows":95,"n_cols":10,"rows_kept":95,"cut":false,"hidden":false,"merged":[[45,7,46,7],[45,8,46,8],[45,9,46,9],[15,1,15,4],[43,0,43,4],[45,2,46,2],[45,3,46,3],[45,4,46,4],[45,5,46,5],[45,6,46,6],[0,2,1,7],[6,0,6,10],[10,0,10,4],[12,2,13,2],[12,3,13,3],[12,5,13,5],[12,4,13,4],[12,6,13,6],[12,7,13,7],[12,8,13,8],[12,9,13,9],[48,1,48,4],[111,0,111,10],[77,0,77,4],[82,1,82,4],[79,2,80,2],[79,3,80,3],[79,4,80,4],[79,5,80,5],[79,6,80,6],[79,7,80,7],[79,8,80,8],[79,9,80,9]]}
[null,null,"Net ZEB Evaluation Tool"]
[]
[null,null,null,"Developed within the IEA - SHC Task 40/ECBCS Annex 52 - \"Towards Net Zero Energy solar Buildings\""]
[null,null,null,"Created by: Eurac Research within subtask A"]
[]
[]
["Building Project - quasi-static Net ZEB evaluation"]
[]
[]
[]
["                              GENERATION/LOAD BALANCE"]
[]
[null,null,null,"kWhpe/m²y",null,"kWhpe/m²y",null,"__/m²y",null,"kgCO2eq/m²y"]
[]
[]
[null,"Generation/Load balance",null,null,null,null,"Electricity Load Match"]
[]
[]
[]
[]
{"$rows_left_out":76}
{"sheet":"quasi-static weighting factors","index":1,"n_rows":41,"n_cols":16,"rows_kept":41,"cut":false,"hidden":false,"merged":[[19,15,19,16],[39,15,39,16],[40,15,40,16],[0,0,1,16],[2,0,4,1],[6,0,6,16],[11,15,11,16],[12,15,12,16],[20,15,20,16],[25,15,25,16],[26,15,26,16],[33,15,33,16],[34,15,34,16]]}
["Net ZEB Evaluation Tool"]
[]
[null,null,null,null,null,"Developed within the IEA - SHC Task 40/ECBCS Annex 52 - \"Towards Net Zero Energy solar Buildings\""]
[null,null,null,null,null,"Created by: Eurac Research within subtask A"]
[]
[]
["quasi-static weighting factors"]
[]
[null,"PRIMARY ENERGY FACTORS"]
[]
[null,"Wi [kWhpe/kWhi]",null,"jan","feb","mar","apr","may","jun","jul","aug","sep","oct","nov","dec","Note"]
[null,"Wi1 - electricity"]
[null,"Wi5 - heat"]
[]
[null,"STRATEGIC FACTORS"]
[]
[null,"Asymmetric strategic weighting  factors  for exported energy - We,i"]
[]
[null,"We,i [kWh/kWhi]",null,"jan","feb","mar","apr","may","jun","jul","aug","sep","oct","nov","dec","Note"]
[null,"We,i1 - electricity"]
{"$rows_left_out":22}
{"sheet":"Building Data","index":2,"n_rows":132,"n_cols":19,"rows_kept":132,"cut":false,"hidden":false,"merged":[[8,2,8,7],[11,2,11,7],[44,2,44,3],[103,2,103,3],[104,2,104,3],[104,11,104,14],[105,1,109,1],[105,2,105,3],[105,11,105,14],[106,2,106,3],[106,11,106,14],[107,2,107,3],[107,11,107,14],[108,2,108,3],[108,11,108,14],[109,2,109,3],[109,11,109,14],[73,1,76,1],[73,2,73,3],[73,11,73,14],[74,2,74,3],[74,11,74,14],[68,1,72,1],[27,2,27,3],[117,2,117,3],[118,2,118,3],[118,11,118,14],[119,2,119,3],[119,11,119,14],[110,1,113,1],[110,2,110,3],[110,11,110,14],[111,2,111,3],[111,11,111,14],[112,2,112,3],[112,11,112,14],[113,2,113,3],[113,11,113,14],[76,11,76,14],[34,2,34,3],[36,2,36,3],[37,2,37,3],[35,11,35,14],[36,11,36,14],[37,11,37,14],[28,2,28,3],[71,2,71,3],[71,11,71,14],[72,2,72,3],[72,11,72,14],[28,11,28,14],[43,11,43,14],[42,2,42,3],[43,2,43,3],[68,2,68,3],[68,11,68,14],[69,2,69,3],[69,11,69,14],[70,2,70,3],[70,11,70,14],[27,11,27,14],[9,4,9,7],[41,2,41,3],[38,2,38,3],[39,2,39,3],[82,2,82,3],[82,11,82,14],[35,2,35,3],[41,11,41,14],[40,11,40,14],[38,11,38,14],[39,11,39,14],[40,2,40,3],[42,11,42,14],[66,2,66,3],[67,2,67,3],[67,11,67,14],[80,2,80,3],[81,2,81,3],[81,11,81,14],[45,2,45,3],[75,2,75,3],[75,11,75,14],[76,2,76,3],[10,4,10,7],[12,2,12,7],[99,3,99,4],[0,0,1,14],[2,0,4,2],[6,0,6,14],[19,11,19,14],[26,11,26,14],[22,11,22,14],[20,2,20,3],[21,2,21,3],[22,2,22,3],[21,11,21,14],[20,11,20,14],[19,2,19,3],[18,2,18,3],[23,2,23,3],[23,11,23,14],[24,11,24,14],[24,2,24,3],[26,2,26,3],[20,1,25,1],[26,1,30,1],[29,2,29,3]]}
["Net ZEB Evaluation Tool"]
[]
[null,null,null,"Developed within the IEA - SHC Task 40/ECBCS Annex 52 - \"Towards Net Zero Energy solar Buildings\""]
[null,null,null,"Created by: Eurac Research within subtask A"]
[]
[]
["Building Project - Input Data"]
[]
[null,"Name of project"]
[null,"Building type",null,null,null,null,null,null,null,null,null,null,null,null,null,null,null,"RESIDENTIAL",1]
[null,"Location (city, country)",null,null,null,null,null,null,null,null,null,null,null,null,null,null,null,"NON RESIDENTIAL"]
[null,"Energy rating"]
[null,"Web site"]
[]
[null,"BUILDING DESIGN DATA"]
[]
[null,"gi Energy generation"]
[]
[null,null,"i - energy carrier",null,"i1","i5","i6","i8","i9","i10","i11"]
[null,null,"gi - energy generation by:",null,"electricity\n[kWhel/m²y]","heat to district heating [kWhh/m²y]","cold to district cooling [kWhc/m²y]","enter one more energy source produced [kWh/m²y]","enter one more energy source produced [kWh/m²y]","enter one more energy source produced [kWh/m²y]","enter one more energy source produced [kWh/m²y]","Note"]
{"$rows_left_out":113}
{"sheet":"static weighting factors","index":3,"n_rows":63,"n_cols":13,"rows_kept":63,"cut":false,"hidden":false,"merged":[[49,11,49,13],[50,11,50,13],[51,11,51,13],[52,11,52,13],[58,11,58,13],[44,11,44,13],[45,11,45,13],[46,11,46,13],[47,11,47,13],[48,11,48,13],[26,11,26,13],[27,11,27,13],[28,11,28,13],[29,11,29,13],[35,11,35,13],[21,11,21,13],[22,11,22,13],[23,11,23,13],[24,11,24,13],[25,11,25,13],[62,7,63,7],[57,2,57,3],[58,2,58,3],[56,2,56,3],[49,1,52,1],[49,2,49,3],[50,2,50,3],[51,2,51,3],[52,2,52,3],[34,2,34,3],[35,2,35,3],[42,2,42,3],[43,2,43,3],[44,1,48,1],[44,2,44,3],[45,2,45,3],[46,2,46,3],[47,2,47,3],[48,2,48,3],[42,1,43,1],[33,2,33,3],[26,1,29,1],[26,2,26,3],[27,2,27,3],[28,2,28,3],[29,2,29,3],[21,1,25,1],[21,2,21,3],[22,2,22,3],[23,2,23,3],[24,2,24,3],[25,2,25,3],[0,0,1,13],[2,0,4,1],[6,0,6,13],[19,2,19,3],[20,2,20,3],[10,1,11,1],[19,1,20,1]]}
["Net ZEB Evaluation Tool"]
[]
[null,null,null,null,null,"Developed within the IEA - SHC Task 40/ECBCS Annex 52 - \"Towards Net Zero Energy solar Buildings\""]
[null,null,null,null,null,"Created by: Eurac Research within subtask A"]
[]
[]
["static weighting factors"]
[]
[null,"PRIMARY ENERGY FACTORS"]
[]
[null,"Wi [kWhpe/kWhi]","i1","i2","i3","i4","i5","i6","i7","i8","i9","i10","i11"]
[null,null,"electricity ","oil ","gas ","biomass ","heat from/to district heating ","cold from/to district cooling ","enter one more energy source ","enter one more energy source ","enter one more energy source ","enter one more energy source ","enter one more energy source "]
[null,"Symmetric primary energy factors"]
[null,"Note"]
[]
[null,"STRATEGIC FACTORS"]
[]
[null,"Asymmetric strategic weighting  factors  for exported energy - We,i-sys"]
[]
[null,"We,i-sys [Uwe/kWhi]","i - energy carrier",null,"i1","i5","i6","i8","i9","i10","i11"]
{"$rows_left_out":44}
{"sheet":"Operating costs","index":4,"n_rows":41,"n_cols":12,"rows_kept":41,"cut":false,"hidden":false,"merged":[[32,11,32,12],[33,11,33,12],[34,11,34,12],[40,11,40,12],[27,11,27,12],[28,11,28,12],[29,11,29,12],[30,11,30,12],[31,11,31,12],[17,11,17,12],[18,11,18,12],[19,11,19,12],[20,11,20,12],[26,11,26,12],[12,11,12,12],[13,11,13,12],[14,11,14,12],[15,11,15,12],[16,11,16,12],[38,2,38,3],[39,2,39,3],[40,2,40,3],[31,1,34,1],[31,2,31,3],[32,2,32,3],[33,2,33,3],[34,2,34,3],[24,2,24,3],[25,2,25,3],[26,1,30,1],[26,2,26,3],[27,2,27,3],[28,2,28,3],[29,2,29,3],[30,2,30,3],[24,1,25,1],[17,1,20,1],[17,2,17,3],[18,2,18,3],[19,2,19,3],[20,2,20,3],[12,1,16,1],[12,2,12,3],[13,2,13,3],[14,2,14,3],[15,2,15,3],[16,2,16,3],[0,0,1,12],[2,0,4,1],[6,0,6,12],[10,2,10,3],[11,2,11,3],[10,1,11,1]]}
["Net ZEB Evaluation Tool"]
[]
[null,null,null,null,"Developed within the IEA - SHC Task 40/ECBCS Annex 52 - \"Towards Net Zero Energy solar Buildings\""]
[null,null,null,null,"Created by: Eurac Research within subtask A"]
[]
[]
["Operating energy costs"]
[]
[null,"Specific costs for exported energy"]
[]
[null,"Ce(i-sys) per kWh","i - energy carrier",null,"i1","i5","i6","i8","i9","i10","i11"]
[null,null,"sys-energy generation system",null,"electricity","heat to district heating","cold to district cooling ","enter one more energy source produced ","enter one more energy source produced ","enter one more energy source produced","enter one more energy source produced","Note"]
[null,"building on-site generation systems connected to the energy infrastructure\n","PV"]
[null,null,"cogeneration/trigeneration"]
[null,null,"solar thermal"]
[null,null,"enter one more generation system"]
[null,null,"enter one more generation system"]
[null,"building off-site generation systems connected to the energy infrastructure\n","PV"]
[null,null,"wind turbine"]
[null,null,"enter one more generation system"]
{"$rows_left_out":22}
{"sheet":"Net ZEB evaluation","index":5,"n_rows":109,"n_cols":10,"rows_kept":109,"cut":false,"hidden":false,"merged":[[111,0,111,10],[74,6,75,7],[74,8,75,9],[82,1,82,4],[77,0,77,4],[74,2,75,3],[74,4,75,5],[108,2,109,3],[108,4,109,5],[108,6,109,7],[108,8,109,9],[79,2,80,2],[79,8,80,8],[12,8,13,8],[79,9,80,9],[79,3,80,3],[79,4,80,4],[48,1,48,4],[45,2,46,2],[45,3,46,3],[45,4,46,4],[45,5,46,5],[45,6,46,6],[45,7,46,7],[45,8,46,8],[45,9,46,9],[79,5,80,5],[79,6,80,6],[79,7,80,7],[12,9,13,9],[43,0,43,4],[0,2,1,7],[6,0,6,10],[10,0,10,4],[15,1,15,4],[40,2,41,3],[40,4,41,5],[40,6,41,7],[40,8,41,9],[12,2,13,2],[12,3,13,3],[12,4,13,4],[12,5,13,5],[12,6,13,6],[12,7,13,7]]}
[null,null,"Net ZEB Evaluation Tool"]
[]
[null,null,null,"Developed within the IEA - SHC Task 40/ECBCS Annex 52 - \"Towards Net Zero Energy solar Buildings\""]
[null,null,null,"Created by: Eurac Research within subtask A"]
[]
[]
["Building Project - static Net ZEB evaluation"]
[]
[]
[]
["                              GENERATION/LOAD BALANCE"]
[]
[null,null,null,"kWhpe/m²y",null,"kWhpe/m²y",null,"__/m²y",null,"kgCO2eq/m²y"]
[]
[]
[null,"Generation/Load balance",null,null,null,null,"Electricity Load Match"]
[]
[]
[]
[]
{"$rows_left_out":90}
{"sheet":"Calculation","index":6,"n_rows":170,"n_cols":60,"rows_kept":170,"cut":false,"hidden":true,"merged":[[146,13,146,14],[147,13,147,14],[19,7,19,8],[13,13,13,14],[14,13,14,14],[15,13,15,14],[16,13,16,14],[19,13,20,17],[122,1,122,5],[122,6,122,9],[120,13,120,14],[121,13,121,14],[122,13,122,14],[117,1,117,5],[117,6,117,9],[13,7,13,8],[14,7,14,8],[15,7,15,8],[17,1,21,1],[17,7,17,8],[18,7,18,8],[21,14,21,15],[21,16,21,17],[21,13,22,13],[0,3,1,15],[2,3,2,15],[3,3,3,15],[4,3,4,15],[12,27,12,28],[10,23,10,24],[10,25,10,26],[12,23,12,24],[12,21,12,22],[12,25,12,26],[6,0,6,17],[11,7,11,8],[12,7,12,8],[11,1,16,1],[16,7,16,8],[10,13,10,17],[86,13,86,14],[83,13,83,14],[80,13,80,17],[48,23,48,24],[32,13,32,17],[35,13,35,14],[47,1,51,1],[47,7,47,8],[2,0,4,2],[48,25,48,26],[49,13,49,14],[50,13,50,14],[51,13,51,14],[46,13,46,17],[52,1,55,1],[82,27,82,28],[52,13,52,14],[80,23,80,24],[80,25,80,26],[81,1,85,1],[81,7,81,8],[57,13,57,17],[60,13,60,14],[61,13,61,14],[62,13,62,14],[63,13,63,14],[84,13,84,14],[85,13,85,14],[163,1,163,5],[163,6,163,9],[158,1,158,5],[158,6,158,9],[86,1,89,1],[142,1,142,5],[142,6,142,9],[112,0,112,18],[119,13,119,14],[144,13,144,14],[163,13,163,14],[157,13,157,18],[141,13,141,18],[116,13,116,18],[160,13,160,14],[161,13,161,14],[162,13,162,14],[91,13,91,17],[95,13,95,14],[96,13,96,14],[97,13,97,14],[147,1,147,5],[147,6,147,9],[145,13,145,14],[8,37,9,37],[93,21,93,22],[93,23,93,24],[93,25,93,26],[93,27,93,28],[94,13,94,14],[34,21,34,22],[34,23,34,24],[34,25,34,26],[34,27,34,28],[59,21,59,22],[59,23,59,24],[59,25,59,26],[59,27,59,28],[82,21,82,22],[82,23,82,24],[82,25,82,26],[48,27,48,28],[46,23,46,24],[46,25,46,26],[36,13,36,14],[37,13,37,14],[38,13,38,14],[48,21,48,22],[8,47,9,47],[8,48,9,48],[8,49,9,49],[8,50,9,50],[8,51,9,51],[8,52,9,52],[8,53,9,53],[8,38,9,38],[8,39,9,39],[8,40,9,40],[8,41,9,41],[8,42,9,42],[8,43,9,43]]}
[null,null,null,"Net ZEB definitions Evaluation Tool"]
[]
[null,null,null,"Developed within the IEA - SHC Task 40/ECBCS Annex 126 - \"Towards Net Zero Energy solar Buildings\""]
[null,null,null,"Created by: Eurac Research within STA"]
[null,null,null,"Draft: V4.3",null,null,null,null,null,null,null,null,null,null,null,null,null,null,null,null,null,null,null,null,null,null,null,null,null,null,null,null,null,null,null,null,null,10]
[]
["Building Project - Balance calculation",null,null,null,null,null,null,null,null,null,null,null,null,null,null,null,null,null,null,null,null,null,null,null,null,null,null,null,null,null,null,null,null,null,null,null,null,null,null,null,null,null,null,null,null,null,null,null,null,null,null,null,null,null,null,null,null,null,"sources"]
[null,null,null,null,null,null,null,null,null,null,null,null,null,null,null,null,null,null,null,null,null,null,null,null,null,null,null,null,null,null,null,null,null,null,null,null,null,"Wi [kWhpe/kWhi]","i1","i2","i3","i4","i5","i6",null,null,null,"Wi [kWhpe/kWhi]","i1","i2","i3","i4","i5","i6",null,null,null,null,"Denmark","The Danish Building  Code 2010, BR 2010"]
["BUILDING DESIGN",null,null,null,null,null,null,null,null,null,null,null,null,null,null,null,null,null,null,null,null,null,null,null,null,null,null,null,null,null,null,null,null,null,null,null,null,"Symmetric primary energy factors","electricity ","oil ","gas ","biomass ","heat from/to district heating ","cold from/to district cooling ",null,null,null,"Symmetric emission factors","electricity ","oil ","gas ","biomass ","heat from/to district heating ","cold from/to district cooling ",null,null,null,null,"Austria","Database of GEMIS, Global Emission Model for Integrated Systems, internet page of the program: http://www.oeko.de/service/gemis/en/"]
[null,null,null,null,null,null,null,null,null,null,null,null,null,null,null,null,null,null,null,null,null,null,"x = load/demand",null,null,null,null,null,null,null,null,null,null,null,null,null,null,null,null,null,null,null,null,null,null,null,null,null,null,null,null,null,null,null,null,null,null,null,"Norway","NS 3700 (2010) Criteria for passive houses and low energy buildings - residential buildings, Standards Norway."]
[null,"Weighted Supply items",null,"Primary energy","Strategic factor","Emission",null,"Weighted Demand items",null,"Primary energy","Strategic factor","Emission",null,"Generation/load balance (yearly data)",null,null,null,null,null,null,null,null,"y = generation/supply",null,null,null,null,null,null,null,null,null,null,null,null,null,null,"AUSTRIA",1.91,1.1299999999999999,1.1200000000000001,1.1599999999999999,0.77,null,"GEMIS Version 4.5",null,null,"AUSTRIA",0.38900000000000001,0.30199999999999999,0.26800000000000002,4.1000000000000002E-2,0.219,null,"GEMIS Version 4.5",null,null,null,null,"SINTEF Energy Research (2011) CO2 emissions in different scnarios of electricity generation in Europa, Report for the Zero Emission Building research centre, TR A7058."]
[null,"on-site","PV",{"$f":"'Building Data'!E21*'static weighting factors'!C13","v":0},{"$f":"SUMPRODUCT('Building Data'!E21:K21,'static weighting factors'!E22:K22)","v":0},{"$f":"SUMPRODUCT('Building Data'!E21:K21,'static weighting factors'!E45:K45)","v":0},null,"heating ",null,{"$f":"SUMPRODUCT('Building Data'!E37:K37,'static weighting factors'!$C$13:$I$13)","v":0},{"$f":"SUMPRODUCT('Building Data'!E37:K37,'static weighting factors'!$E$36:$K$36)","v":0},{"$f":"SUMPRODUCT('Building Data'!E37:K37,'static weighting factors'!$E$59:$K$59)","v":0},null,null,null,null,null,null,null,null,null,null,null,null,null,null,null,null,null,null,null,null,null,null,null,null,null,"DENMARK",2.5,1,1,1,1,null,"BR 2010",null,null,"DENMARK",null,null,null,null,null,null,null,null,null,null,"Sweden","http://www.sweden.gov.se/content/1/c6/10/01/76/9e6cf104.pdf, download, 27.7.2011"]
[null,null,"cogeneration",{"$f":"'Building Data'!E22*'static weighting factors'!C13+'Building Data'!F22*'static weighting factors'!H13+'Building Data'!G22*'static weighting factors'!I13","v":0},{"$f":"SUMPRODUCT('Building Data'!E22:K22,'static weighting factors'!E23:K23)","v":0},{"$f":"SUMPRODUCT('Building Data'!E22:K22,'static weighting factors'!E46:K46)","v":0},null,"DHW ",null,{"$f":"SUMPRODUCT('Building Data'!E38:K38,'static weighting factors'!$C$13:$I$13)","v":0},{"$f":"SUMPRODUCT('Building Data'!E38:K38,'static weighting factors'!$E$36:$K$36)","v":0},{"$f":"SUMPRODUCT('Building Data'!E38:K38,'static weighting factors'!$E$59:$K$59)","v":0},null,null,null,"Generation","Load","Balance",null,null,null,"Net ZEB limited",null,"Net ZEB primary",null,"Net ZEB strategic",null,"Net ZEB carbon",null,null,null,null,null,null,null,null,null,"FINLAND",1.7,1,1,0.5,0.7,null,"BC 2012",null,null,"FINLAND",0.32900000000000001,0.27900000000000003,0.20200000000000001,3.2000000000000001E-2,0.23,null,"BC 2012",null,null,null,"Finland","National Building Code of Finland. Part D3 Energy-Efficiency. Ministry of Environment 2011"]
[null,null,"solar thermal",{"$f":"'Building Data'!F23*'static weighting factors'!G13","v":0},{"$f":"SUMPRODUCT('Building Data'!E23:K23,'static weighting factors'!E24:K24)","v":0},{"$f":"SUMPRODUCT('Building Data'!E23:K23,'static weighting factors'!E47:K47)","v":0},null,"cooling",null,{"$f":"SUMPRODUCT('Building Data'!E39:K39,'static weighting factors'!$C$13:$I$13)","v":0},{"$f":"SUMPRODUCT('Building Data'!E39:K39,'static weighting factors'!$E$36:$K$36)","v":0},{"$f":"SUMPRODUCT('Building Data'!E39:K39,'static weighting factors'!$E$59:$K$59)","v":0},null,"Net ZEB limited",null,{"$f":"IF(D17=0,SUM(D12:D16),D17)","v":0},{"$f":"IF(AND(J21=0,'Building Data'!S10=1),SUM(Calculation!J12:J14,Calculation!J16:J17,Calculation!J19),IF(AND(J21=0,'Building Data'!S10=2),SUM(Calculation!J12:J17,Calculation!J19),Calculation!J21))","v":0},{"$f":"P14-Q14","v":0},null,null,null,"x","y","x","y","x","y","x","y",null,null,null,null,null,null,null,null,"GERMANY",2.6,1.1000000000000001,1.1000000000000001,0.2,0.7,null,"DIN V 18599/1",null,null,"GERMANY",0.63300000000000001,0.30199999999999999,0.24399999999999999,4.1000000000000002E-2,0.219,null,"DIN V 18599/1",null,null,null,null,"Database of GEMIS, Global Emission Model for Integrated Systems, internet page of the program: http://www.oeko.de/service/gemis/en/"]
[null,null,"add",{"$f":"'Building Data'!E24*'static weighting factors'!C13+'Building Data'!F24*'static weighting factors'!G13+'Building Data'!G24*'static weighting factors'!H13+SUMPRODUCT('Building Data'!H24:K24,'static weighting factors'!J13:M13)","v":0},{"$f":"SUMPRODUCT('Building Data'!E24:K24,'static weighting factors'!E25:K25)","v":0},{"$f":"SUMPRODUCT('Building Data'!E24:K24,'static weighting factors'!E48:K48)","v":0},null,"built-in lighting",null,{"$f":"SUMPRODUCT('Building Data'!E40:K40,'static weighting factors'!$C$13:$I$13)","v":0},{"$f":"SUMPRODUCT('Building Data'!E40:K40,'static weighting factors'!$E$36:$K$36)","v":0},{"$f":"SUMPRODUCT('Building Data'!E40:K40,'static weighting factors'!$E$59:$K$59)","v":0},null,"Net ZEB primary",null,{"$f":"IF(D17=0,SUM(D12:D16),D17)","v":0},{"$f":"IF(J21=0,SUM(J12:J20),J21)","v":0},{"$f":"P15-Q15","v":0},null,null,"WD",{"$f":"Q14","v":0},0,{"$f":"Q15","v":0},0,{"$f":"Q16","v":0},0,{"$f":"Q17","v":0},0,null,"bisector",0,0,null,null,null,null,"ITALY",2.1800000000000002,1,1,0,null,null,"UNI TS 11300/4",null,null,"ITALY",0.53100000000000003,null,null,null,null,null,"UNI TS 11300/4",null,null,null,null,"Motiva report, 2004, emission factors and calculation of emission factors. Available at: http://www.motiva.fi/files/209/Laskentaohje_CO2_kohde_040622.pdf"]
[null,null,"add",{"$f":"'Building Data'!E25*'static weighting factors'!$C$13+'Building Data'!F25*'static weighting factors'!$G$13+'Building Data'!G25*'static weighting factors'!$H$13+SUMPRODUCT('Building Data'!H25:K25,'static weighting factors'!J13:M13)","v":0},{"$f":"SUMPRODUCT('Building Data'!E25:K25,'static weighting factors'!E26:K26)","v":0},{"$f":"SUMPRODUCT('Building Data'!E25:K25,'static weighting factors'!E49:K49)","v":0},null,"auxiliaries",null,{"$f":"SUMPRODUCT('Building Data'!E41:K41,'static weighting factors'!$C$13:$I$13)","v":0},{"$f":"SUMPRODUCT('Building Data'!E41:K41,'static weighting factors'!$E$36:$K$36)","v":0},{"$f":"SUMPRODUCT('Building Data'!E41:K41,'static weighting factors'!$E$59:$K$59)","v":0},null,"Net ZEB strategic",null,{"$f":"IF(SUM(E17,E22)=0,SUM(E12:E16,E18:E21),SUM(E17,E22))","v":0},{"$f":"IF(K21=0,SUM(K12:K20),K21)","v":0},0,null,null,"WS",0,{"$f":"P14","v":0},0,{"$f":"P15","v":0},0,{"$f":"P16","v":0},0,{"$f":"P17","v":0},null,null,{"$f":"MAX(V17:AC17)","v":0},{"$f":"AF16","v":0},null,null,null,null,"NORWAY",null,null,null,null,null,null,"under development, will be soon available",null,null,"NORWAY",null,null,null,null,null,null,"under development, will be soon available",null,null,null,"Germany","DIN V 18599:2007-02, part 10, Beuth-Verlag, Berlin, 2009"]
[null,null,"TOTAL",{"$f":"'Building Data'!E26*'static weighting factors'!$C$13+SUMPRODUCT('Building Data'!F26:G26,'static weighting factors'!$G$13:$H$13)+SUMPRODUCT('Building Data'!H26:K26,'static weighting factors'!$J$13:$M$13)","v":0},{"$f":"'Building Data'!E26*Calculation!O24+'Building Data'!F26*Calculation!O25+'Building Data'!G26*Calculation!O26+'Building Data'!H26*Calculation!O27+'Building Data'!I26*Calculation!O28+'Building Data'!J26*Calculation!O29+'Building Data'!K26*Calculation!O30","v":0},{"$f":"'Building Data'!E26*Calculation!Q24+'Building Data'!F26*Calculation!Q25+'Building Data'!G26*Calculation!Q26+'Building Data'!H26*Calculation!Q27+'Building Data'!I26*Calculation!Q28+'Building Data'!J26*Calculation!Q29+'Building Data'!K26*Calculation!Q30","v":0},null,"ventilation",null,{"$f":"SUMPRODUCT('Building Data'!E42:K42,'static weighting factors'!$C$13:$I$13)","v":0},{"$f":"SUMPRODUCT('Building Data'!E42:K42,'static weighting factors'!$E$36:$K$36)","v":0},{"$f":"SUMPRODUCT('Building Data'!E42:K42,'static weighting factors'!$E$59:$K$59)","v":0},null,"Net ZEB carbon",null,{"$f":"IF(F17=0,SUM(F12:F16),F17)","v":0},{"$f":"IF(L21=0,SUM(L12:L20),L21)","v":0},0,null,null,"Balance",{"$f":"V15","v":0},{"$f":"W16","v":0},{"$f":"X15","v":0},{"$f":"Y16","v":0},{"$f":"Z15","v":0},{"$f":"AA16","v":0},{"$f":"AB15","v":0},{"$f":"AC16","v":0},null,null,null,null,null,null,null,null,"SPAIN",2.6,1.08,1.1000000000000001,0,null,null,"CALENER",null,null,"SPAIN",0.64900000000000002,0.28699999999999998,0.20399999999999999,null,null,null,"CALENER",null,null,null,null,"Database of GEMIS, Global Emission Model for Integrated Systems, internet page of the program: http://www.oeko.de/service/gemis/en/"]
[null,"off-site","PV",{"$f":"'Building Data'!E27*'static weighting factors'!C13","v":0},{"$f":"SUMPRODUCT('Building Data'!E27:K27,'static weighting factors'!E27:K27)","v":0},{"$f":"SUMPRODUCT('Building Data'!E27:K27,'static weighting factors'!E50:K50)","v":0},null,"plug loads",null,{"$f":"SUMPRODUCT('Building Data'!E43:K43,'static weighting factors'!$C$13:$I$13)","v":0},{"$f":"SUMPRODUCT('Building Data'!E43:K43,'static weighting factors'!$E$36:$K$36)","v":0},{"$f":"SUMPRODUCT('Building Data'!E43:K43,'static weighting factors'!$E$59:$K$59)","v":0},null,null,null,null,null,null,null,null,null,null,null,null,null,null,null,null,null,null,null,null,null,null,null,null,null,"SWEDEN",1.5,null,1.2,1.2,0.9,null,"calcualted according to EN15316. ","For electricity, calculations are based on Nordic electricity",null,"SWEDEN",null,null,null,null,null,null,"calcualted according to EN15316. ",null,null,null,"Italy","UNI-TS 11300 Part IV,under review (last draft 2009)-LA NORMATIVA TECNICA DI RIFERIMENTO SUL RISPARMIO ENERGETICO E LA CERTIFICAZIONE ENERGETICA DEGLI EDIFICI\n"]
[null,null,"wind turbine",{"$f":"'Building Data'!E28*'static weighting factors'!C13","v":0},{"$f":"SUMPRODUCT('Building Data'!E28:K28,'static weighting factors'!E28:K28)","v":0},{"$f":"SUMPRODUCT('Building Data'!E28:K28,'static weighting factors'!E51:K51)","v":0},null,"combined h & p",null,{"$f":"SUMPRODUCT('Building Data'!E44:K44,'static weighting factors'!$C$13:$I$13)","v":0},{"$f":"SUMPRODUCT('Building Data'!E44:K44,'static weighting factors'!$E$36:$K$36)","v":0},{"$f":"SUMPRODUCT('Building Data'!E44:K44,'static weighting factors'!$E$59:$K$59)","v":0},null,null,null,null,null,null,null,null,null,null,null,null,null,null,null,null,null,null,null,null,null,null,null,null,null,"SWITZERLAND",2.97,1.24,1.1499999999999999,1.22,0.8,null,"SIA 2031",null,null,"SWITZERLAND",0.154,0.29499999999999998,0.24099999999999999,3.5999999999999997E-2,0.16200000000000001,null,"SIA 2031",null,null,null,null,"* EEN3/08 resolution by AEEG - GU n. 100, 29.4.08 - SO n.107 - www.http://www.autorita.energia.it/it/docs/08/003-08een.htm"]
[null,null,"add",{"$f":"'Building Data'!E29*'static weighting factors'!$C$13+'Building Data'!F29*'static weighting factors'!$G$13+'Building Data'!G29*'static weighting factors'!$H$13+SUMPRODUCT('Building Data'!H29:K29,'static weighting factors'!$J$13:$M$13)","v":0},{"$f":"SUMPRODUCT('Building Data'!E29:K29,'static weighting factors'!E29:K29)","v":0},{"$f":"SUMPRODUCT('Building Data'!E30:K30,'static weighting factors'!E53:K53)","v":0},null,"other",null,{"$f":"SUMPRODUCT('Building Data'!E45:K45,'static weighting factors'!$C$13:$I$13)","v":0},{"$f":"SUMPRODUCT('Building Data'!E45:K45,'static weighting factors'!$E$36:$K$36)","v":0},{"$f":"SUMPRODUCT('Building Data'!E45:K45,'static weighting factors'!$E$59:$K$59)","v":0},null,"Average values of asymmetric weighting factors for energy generation",null,null,null,null,null,null,null,null,null,null,null,null,null,null,null,null,null,null,null,null,null,null,null,"OTHER",null,null,null,null,null,null,null,null,null,"OTHER",null,null,null,null,null,null,null,null,null,null,null,"**www.minambiente.it/home_it/menu.html?mp=/menu/menu_attivita/&m=argomenti.html|Fonti_rinnovabili.html|Fotovoltaico.html|Costi__Vantaggi__e_Mercato.html"]
{"$rows_left_out":150}